Target
Hepatocyte growth factor receptor
Ligand
BDBM50189787
Substrate
Meas. Tech.
ChEMBL_1590287 (CHEMBL3830179)
IC50
>100±n/a nM
Citation
 Yan, WWang, XDai, YZhao, BYang, XFan, JGao, YMeng, FWang, YLuo, CAi, JGeng, MDuan, W Discovery of 3-(5'-Substituted)-Benzimidazole-5-(1-(3,5-dichloropyridin-4-yl)ethoxy)-1H-indazoles as Potent Fibroblast Growth Factor Receptor Inhibitors: Design, Synthesis, and Biological Evaluation. J Med Chem 59:6690-708 (2016)  
Target
Name:
Hepatocyte growth factor receptor
Synonyms:
Hepatocyte growth factor receptor Hepatocyte growth factor receptor (c-MET) MET Met proto-oncogene (hepatocyte growth factor receptor) Tyrosine-protein kinase Met (c-Met) c-Met kinase
Type:
Protein
Mol. Mass.:
155559.73
Organism:
Homo sapiens (Human)
Description:
P08581
Residue:
1390
  
Inhibitor
Name:
BDBM50189787
Synonyms:
CHEMBL3827178
Type:
Small organic molecule
Emp. Form.:
C26H25Cl2N7O
Mol. Mass.:
522.429
SMILES:
C[C@@H](Oc1ccc2[nH]nc(-c3nc4cc(ccc4[nH]3)N3CCN(C)CC3)c2c1)c1c(Cl)cncc1Cl
: