Target
Breakpoint cluster region protein/Tyrosine-protein kinase ABL1
Ligand
BDBM50189787
Substrate
Meas. Tech.
ChEMBL_1590292 (CHEMBL3830184)
IC50
>100±n/a nM
Citation
 Yan, WWang, XDai, YZhao, BYang, XFan, JGao, YMeng, FWang, YLuo, CAi, JGeng, MDuan, W Discovery of 3-(5'-Substituted)-Benzimidazole-5-(1-(3,5-dichloropyridin-4-yl)ethoxy)-1H-indazoles as Potent Fibroblast Growth Factor Receptor Inhibitors: Design, Synthesis, and Biological Evaluation. J Med Chem 59:6690-708 (2016)  
Target
Name:
Breakpoint cluster region protein/Tyrosine-protein kinase ABL1
Synonyms:
Bcr-Abl Breakpoint cluster region protein /Tyrosine-protein kinase ABL | Tyrosine-protein kinase ABL1/Breakpoint cluster region protein
Type:
Enzyme
Mol. Mass.:
Description:
Components:
This complex has 2 components.
Component 1
Name:
Tyrosine-protein kinase ABL1
Synonyms:
ABL ABL1_HUMAN JTK7 Proto-oncogene tyrosine-protein kinase ABL1 Tyrosine-protein kinase ABL V-abl Abelson murine leukemia viral oncogene homolog 1 p150 | tyrosine-protein kinase ABL1 isoform a
Type:
Enzyme
Mol. Mass.:
122897.30
Organism:
Homo sapiens (Human)
Description:
P00519
Residue:
1130
  
Component 2
Name:
Breakpoint cluster region protein
Synonyms:
BCR BCR_HUMAN Breakpoint cluster region protein | D22S11
Type:
PROTEIN
Mol. Mass.:
142824.75
Organism:
Homo sapiens (Human)
Description:
ChEMBL_305348
Residue:
1271
  
Inhibitor
Name:
BDBM50189787
Synonyms:
CHEMBL3827178
Type:
Small organic molecule
Emp. Form.:
C26H25Cl2N7O
Mol. Mass.:
522.429
SMILES:
C[C@@H](Oc1ccc2[nH]nc(-c3nc4cc(ccc4[nH]3)N3CCN(C)CC3)c2c1)c1c(Cl)cncc1Cl
: