Target
Beta-lactamase
Ligand
BDBM50195796
Substrate
Meas. Tech.
ChEMBL_1617950 (CHEMBL3860119)
IC50
18000±n/a nM
Citation
 Lund, BAChristopeit, TGuttormsen, YBayer, ALeiros, HK Screening and Design of Inhibitor Scaffolds for the Antibiotic Resistance Oxacillinase-48 (OXA-48) through Surface Plasmon Resonance Screening. J Med Chem 59:5542-54 (2016)  
Target
Name:
Beta-lactamase
Synonyms:
Beta-lactamase Synonyms=blaOXA-48 | bla
Type:
PROTEIN
Mol. Mass.:
30363.94
Organism:
Klebsiella pneumoniae
Description:
ChEMBL_103606
Residue:
265
  
Inhibitor
Name:
BDBM50195796
Synonyms:
CHEMBL3910343
Type:
Small organic molecule
Emp. Form.:
C17H12N2O2
Mol. Mass.:
276.2894
SMILES:
OC(=O)c1cc(cc(c1)-c1ccncc1)-c1ccncc1
: