Target
Dihydrofolate reductase
Ligand
BDBM50196287
Substrate
Meas. Tech.
ChEBML_1618320
IC50
20±n/a nM
Citation
 El-Messery, SMHassan, GSNagi, MNHabib, EEAl-Rashood, STEl-Subbagh, HI Synthesis, biological evaluation and molecular modeling study of some new methoxylated 2-benzylthio-quinazoline-4(3H)-ones as nonclassical antifolates. Bioorg Med Chem Lett 26:4815-4823 (2016)  
Target
Name:
Dihydrofolate reductase
Synonyms:
DHFR Dihydrofolate reductase | Dihydrofolate reductase (DHFR)
Type:
Enzyme
Mol. Mass.:
21603.71
Organism:
Bos taurus (Cattle)
Description:
P00376
Residue:
187
  
Inhibitor
Name:
BDBM50196287
Synonyms:
CHEMBL3936506
Type:
Small organic molecule
Emp. Form.:
C22H17ClN2O2S
Mol. Mass.:
408.901
SMILES:
COc1ccc(CSc2nc3ccc(Cl)cc3c(=O)n2-c2ccccc2)cc1
: