Target
Dihydrofolate reductase
Ligand
BDBM50196321
Substrate
Meas. Tech.
ChEMBL_1618320 (CHEMBL3860489)
IC50
3000±n/a nM
Citation
 El-Messery, SMHassan, GSNagi, MNHabib, EEAl-Rashood, STEl-Subbagh, HI Synthesis, biological evaluation and molecular modeling study of some new methoxylated 2-benzylthio-quinazoline-4(3H)-ones as nonclassical antifolates. Bioorg Med Chem Lett 26:4815-4823 (2016)  
Target
Name:
Dihydrofolate reductase
Synonyms:
DHFR Dihydrofolate reductase | Dihydrofolate reductase (DHFR)
Type:
Enzyme
Mol. Mass.:
21603.71
Organism:
Bos taurus (Cattle)
Description:
P00376
Residue:
187
  
Inhibitor
Name:
BDBM50196321
Synonyms:
CHEMBL3938255
Type:
Small organic molecule
Emp. Form.:
C27H28N2O6S
Mol. Mass.:
508.586
SMILES:
COc1ccc(c(OC)c1)-n1c(SCc2cc(OC)c(OC)c(OC)c2)nc2ccc(C)cc2c1=O
: