Target
Voltage-dependent T-type calcium channel subunit alpha-1H
Ligand
BDBM50200840
Substrate
Meas. Tech.
ChEMBL_1622852 (CHEMBL3865204)
IC50
18±n/a nM
Citation
 Siegrist, RPozzi, DJacob, GTorrisi, CColas, KBraibant, BMawet, JPfeifer, Tde Kanter, RRoch, CKessler, MCorminboeuf, OBezençon, O Structure-Activity Relationship, Drug Metabolism and Pharmacokinetics Properties Optimization, and in Vivo Studies of New Brain Penetrant Triple T-Type Calcium Channel Blockers. J Med Chem 59:10661-10675 (2016)  
Target
Name:
Voltage-dependent T-type calcium channel subunit alpha-1H
Synonyms:
CAC1H_HUMAN Low-voltage-activated calcium channel alpha1 3.2 subunit Voltage-gated calcium channel voltage-dependent T-type calcium channel subunit alpha-1H isoform a
Type:
Enzyme Catalytic Domain
Mol. Mass.:
259187.68
Organism:
Homo sapiens (Human)
Description:
Calcium channel (Type T,L) 0 0::O95180
Residue:
2353
  
Inhibitor
Name:
BDBM50200840
Synonyms:
CHEMBL3968363
Type:
Small organic molecule
Emp. Form.:
C24H24F2N4O
Mol. Mass.:
422.4704
SMILES:
C[C@@H]1CN(Cc2ccc(F)c(F)c2)c2ccccc2[C@H](C)N1C(=O)Nc1cccnc1
: