Target
Free fatty acid receptor 1
Ligand
BDBM50207066
Substrate
Meas. Tech.
ChEMBL_1629518 (CHEMBL3872144)
EC50
4400±n/a nM
Citation
 Adams, GLVelazquez, FJayne, CShah, UMiao, SAshley, ERMadeira, MAkiyama, TEDi Salvo, JSuzuki, TWang, NTruong, QGilbert, EZhou, DVerras, AKirkland, MPachanski, MPowles, MYin, WUjjainwalla, FVenkatraman, SEdmondson, SD Discovery of Chromane Propionic Acid Analogues as Selective Agonists of GPR120 with ACS Med Chem Lett 8:96-101 (2017)  
Target
Name:
Free fatty acid receptor 1
Synonyms:
FFAR1 G-protein Coupled Receptor 40 | GPR40
Type:
G Protein-Coupled Receptor (GPCR)
Mol. Mass.:
31473.32
Organism:
Homo sapiens (Human)
Description:
O14842
Residue:
300
  
Inhibitor
Name:
BDBM50207066
Synonyms:
CHEMBL3890089
Type:
Small organic molecule
Emp. Form.:
C20H18F4O5
Mol. Mass.:
414.3475
SMILES:
COc1cc(OC(F)(F)F)cc(c1F)-c1ccc2O[C@@H](CCC(O)=O)CCc2c1
: