Target
Sporulation kinase A
Ligand
BDBM50215984
Substrate
Meas. Tech.
ChEMBL_92720 (CHEMBL872510)
IC50
>500000±n/a nM
Citation
 Sui, ZGuan, JHlasta, DJMacielag, MJFoleno, BDGoldschmidt, RMLoeloff, MJWebb, GCBarrett, JF SAR studies of diaryltriazoles against bacterial two-component regulatory systems and their antibacterial activities. Bioorg Med Chem Lett 8:1929-34 (1998)  
Target
Name:
Sporulation kinase A
Synonyms:
KINA_BACSU Stage II sporulation protein F gsiC scoD spoIIJ
Type:
PROTEIN
Mol. Mass.:
69161.05
Organism:
Bacillus subtilis (strain 168)
Description:
ChEMBL_105028
Residue:
606
  
Inhibitor
Name:
BDBM50215984
Synonyms:
CHEMBL291781
Type:
Small organic molecule
Emp. Form.:
C15H11Cl2N3O2
Mol. Mass.:
336.173
SMILES:
COc1ccc(cc1)-c1n[nH]c(n1)-c1cc(Cl)cc(Cl)c1O
: