Target
Phospho-N-acetylmuramoyl-pentapeptide-transferase
Ligand
BDBM50221504
Substrate
Meas. Tech.
ChEMBL_208265 (CHEMBL813225)
IC50
80.7±n/a nM
Citation
 Hotoda, HDaigo, MFurukawa, MMurayama, KHasegawa, CAKaneko, MMuramatsu, YIshii, MMMiyakoshi, STakatsu, TInukai, MKakuta, MAbe, TFukuoka, TUtsui, YOhya, S Synthesis and antimycobacterial activity of capuramycin analogues. Part 2: acylated derivatives of capuramycin-related compounds. Bioorg Med Chem Lett 13:2833-6 (2003)  
Target
Name:
Phospho-N-acetylmuramoyl-pentapeptide-transferase
Synonyms:
MRAY_ECOLI mraY | murX
Type:
PROTEIN
Mol. Mass.:
39889.38
Organism:
Escherichia coli (strain K12)
Description:
ChEMBL_1454117
Residue:
360
  
Inhibitor
Name:
BDBM50221504
Synonyms:
CHEMBL318623
Type:
Small organic molecule
Emp. Form.:
C31H47N5O12
Mol. Mass.:
681.7312
SMILES:
[H][C@@]1(O[C@H]([C@H](OCCCCCCC)[C@@H]1OC)n1ccc(=O)[nH]c1=O)[C@@H](O[C@H]1OC(=C[C@H](O)[C@@H]1O)C(=O)N[C@H]1CCC[C@@H](C)NC1=O)C(N)=O
: