Target
Prostaglandin E2 receptor EP4 subtype
Ligand
BDBM50232545
Substrate
Meas. Tech.
ChEBML_1648051
IC50
8.8±n/a nM
Citation
 Okumura, YYamagishi, TNukui, SNakao, K Discovery of AAT-008, a novel, potent, and selective prostaglandin EP4 receptor antagonist. Bioorg Med Chem Lett 27:1186-1192 (2017)  
Target
Name:
Prostaglandin E2 receptor EP4 subtype
Synonyms:
PE2R4_HUMAN PGE2 receptor EP4 subtype PTGER4 Prostanoid EP4 receptor
Type:
Enzyme
Mol. Mass.:
53134.53
Organism:
Homo sapiens (Human)
Description:
P35408
Residue:
488
  
Inhibitor
Name:
BDBM50232545
Synonyms:
CHEMBL4078648
Type:
Small organic molecule
Emp. Form.:
C22H17ClFNO4
Mol. Mass.:
413.826
SMILES:
C[C@H](NC(=O)c1cc(Cl)ccc1Oc1cccc(F)c1)c1ccc(cc1)C(O)=O
: