Target
Prostacyclin receptor
Ligand
BDBM50107283
Substrate
Meas. Tech.
ChEBML_1648049
Ki
>5000±n/a nM
Citation
 Okumura, YYamagishi, TNukui, SNakao, K Discovery of AAT-008, a novel, potent, and selective prostaglandin EP4 receptor antagonist. Bioorg Med Chem Lett 27:1186-1192 (2017)  
Target
Name:
Prostacyclin receptor
Synonyms:
PGI receptor PRIPR Prostacyclin (IP) Receptor Prostaglandin I Prostaglandin I2 receptor | Prostanoid IP receptor
Type:
G Protein-Coupled Receptor (GPCR)
Mol. Mass.:
40968.22
Organism:
Homo sapiens (Human)
Description:
The membranes prepared from human platelet were used in binding assay.
Residue:
386
  
Inhibitor
Name:
BDBM50107283
Synonyms:
AAT-007 Grapiprant RQ-00000007 | RQ-7
Type:
Small organic molecule
Emp. Form.:
C26H29N5O3S
Mol. Mass.:
491.605
SMILES:
CCc1nc2c(C)nc(C)cc2n1-c1ccc(CCNC(=O)NS(=O)(=O)c2ccc(C)cc2)cc1
: