Target
Prostaglandin E2 receptor EP4 subtype
Ligand
BDBM50232543
Substrate
Meas. Tech.
ChEMBL_1648051 (CHEMBL3997107)
IC50
26±n/a nM
Citation
 Okumura, YYamagishi, TNukui, SNakao, K Discovery of AAT-008, a novel, potent, and selective prostaglandin EP4 receptor antagonist. Bioorg Med Chem Lett 27:1186-1192 (2017)  
Target
Name:
Prostaglandin E2 receptor EP4 subtype
Synonyms:
PE2R4_HUMAN PGE2 receptor EP4 subtype PTGER4 Prostanoid EP4 receptor
Type:
Enzyme
Mol. Mass.:
53134.53
Organism:
Homo sapiens (Human)
Description:
P35408
Residue:
488
  
Inhibitor
Name:
BDBM50232543
Synonyms:
CHEMBL4096216
Type:
Small organic molecule
Emp. Form.:
C21H16ClFN2O4
Mol. Mass.:
414.814
SMILES:
C[C@H](NC(=O)c1cc(Cl)cnc1Oc1ccc(F)cc1)c1ccc(cc1)C(O)=O
: