Target
Protein-serine O-palmitoleoyltransferase porcupine
Ligand
BDBM50233643
Substrate
Meas. Tech.
ChEMBL_1651041 (CHEMBL4000296)
IC50
>50000±n/a nM
Citation
 Duraiswamy, AJLee, MAMadan, BAng, SHTan, ESCheong, WWKe, ZPendharkar, VDing, LJChew, YSManoharan, VSangthongpitag, KAlam, JPoulsen, AHo, SYVirshup, DMKeller, TH Discovery and Optimization of a Porcupine Inhibitor. J Med Chem 58:5889-99 (2015)  
Target
Name:
Protein-serine O-palmitoleoyltransferase porcupine
Synonyms:
MG61 PORC PORCN_HUMAN Probable protein-cysteine N-palmitoyltransferase porcupine Protein-serine O-palmitoleoyltransferase porcupine
Type:
PROTEIN
Mol. Mass.:
52337.13
Organism:
Homo sapiens (Human)
Description:
ChEMBL_103574
Residue:
461
  
Inhibitor
Name:
BDBM50233643
Synonyms:
CHEMBL4091543
Type:
Small organic molecule
Emp. Form.:
C23H19N3O2
Mol. Mass.:
369.4159
SMILES:
O=C(COc1ccc(cc1)-c1ccn[nH]1)Nc1ccc(cc1)-c1ccccc1
: