Target
Pirin
Ligand
BDBM50234075
Substrate
Meas. Tech.
ChEMBL_1652024 (CHEMBL4001279)
Kd
27±n/a nM
Citation
 Cheeseman, MDChessum, NERye, CSPasqua, AETucker, MJWilding, BEvans, LELepri, SRichards, MSharp, SYAli, SRowlands, MO'Fee, LMiah, AHayes, AHenley, ATPowers, MTe Poele, RDe Billy, EPellegrino, LRaynaud, FBurke, Rvan Montfort, RLEccles, SAWorkman, PJones, K Discovery of a Chemical Probe Bisamide (CCT251236): An Orally Bioavailable Efficacious Pirin Ligand from a Heat Shock Transcription Factor 1 (HSF1) Phenotypic Screen. J Med Chem 60:180-201 (2017)  
Target
Name:
Pirin
Synonyms:
PIR Probable quercetin 2,3-dioxygenase PIR | Probable quercetinase
Type:
PROTEIN
Mol. Mass.:
32115.50
Organism:
Homo sapiens (Human)
Description:
ChEMBL_811273
Residue:
290
  
Inhibitor
Name:
BDBM50234075
Synonyms:
CHEMBL4063438
Type:
Small organic molecule
Emp. Form.:
C28H25N3O3
Mol. Mass.:
451.5164
SMILES:
Cc1ccc2cc(ccc2n1)C(=O)Nc1cc(NC(=O)c2ccc3CCOCc3c2)ccc1C
: