Target
Heat shock factor protein 1
Ligand
BDBM50234089
Substrate
Meas. Tech.
ChEMBL_1652055 (CHEMBL4001310)
IC50
<10000±n/a nM
Citation
 Cheeseman, MDChessum, NERye, CSPasqua, AETucker, MJWilding, BEvans, LELepri, SRichards, MSharp, SYAli, SRowlands, MO'Fee, LMiah, AHayes, AHenley, ATPowers, MTe Poele, RDe Billy, EPellegrino, LRaynaud, FBurke, Rvan Montfort, RLEccles, SAWorkman, PJones, K Discovery of a Chemical Probe Bisamide (CCT251236): An Orally Bioavailable Efficacious Pirin Ligand from a Heat Shock Transcription Factor 1 (HSF1) Phenotypic Screen. J Med Chem 60:180-201 (2017)  
Target
Name:
Heat shock factor protein 1
Synonyms:
HSF1 HSTF1
Type:
PROTEIN
Mol. Mass.:
57244.20
Organism:
Homo sapiens (Human)
Description:
ChEMBL_1512556
Residue:
529
  
Inhibitor
Name:
BDBM50234089
Synonyms:
CHEMBL4063608
Type:
Small organic molecule
Emp. Form.:
C26H23N3O5S
Mol. Mass.:
489.543
SMILES:
Cc1ccc2cc(ccc2n1)C(=O)Nc1cc(NS(=O)(=O)c2ccc3OCCOc3c2)ccc1C
: