Target
Histone deacetylase 4
Ligand
BDBM50235702
Substrate
Meas. Tech.
ChEMBL_1657750 (CHEMBL4007220)
Ki
>50000±n/a nM
Citation
 Meyners, CWolff, BKleinschek, AKrämer, AMeyer-Almes, FJ Perfluorinated hydroxamic acids are potent and selective inhibitors of HDAC-like enzymes from Pseudomonas aeruginosa. Bioorg Med Chem Lett 27:1508-1512 (2017)  
Target
Name:
Histone deacetylase 4
Synonyms:
Cereblon/Histone deacetylase 4 HDAC4 Histone acetylase 4(HDAC4) KIAA0288
Type:
Enzyme
Mol. Mass.:
119049.39
Organism:
Homo sapiens (Human)
Description:
P56524
Residue:
1084
  
Inhibitor
Name:
BDBM50235702
Synonyms:
CHEMBL4104197
Type:
Small organic molecule
Emp. Form.:
C14H7ClF12N2O3
Mol. Mass.:
514.651
SMILES:
ONC(=O)C(F)(F)C(F)(F)C(F)(F)C(F)(F)C(F)(F)C(F)(F)C(=O)Nc1ccccc1Cl
: