Target
5-hydroxytryptamine receptor 4
Ligand
BDBM50007863
Substrate
Ki
22.38±n/a nM
Comments
PDSP_623
Citation
 Claeysen, SFaye, PSebben, MLemaire, SBockaert, JDumuis, A Cloning and expression of human 5-HT4S receptors. Effect of receptor density on their coupling to adenylyl cyclase. Neuroreport 8:3189-96 (1997)  
Target
Name:
5-hydroxytryptamine receptor 4
Synonyms:
5-HT-4 5-HT4L 5-hydroxytryptamine receptor 4 Htr4 Serotonin 4 (5-HT4) receptor
Type:
Enzyme Catalytic Domain
Mol. Mass.:
46117.31
Organism:
RAT
Description:
5-HT4 HTR4 RAT::Q62758
Residue:
406
  
Inhibitor
Name:
BDBM50007863
Synonyms:
6-Methoxy-2-oxo-2,3-dihydro-benzoimidazole-1-carboxylic acid 8-methyl-8-aza-bicyclo[3.2.1]oct-3-yl ester; hydrochloride DAU 6285
Type:
Small organic molecule
Emp. Form.:
C17H21N3O4
Mol. Mass.:
331.3663
SMILES:
COc1ccc2[nH]c(=O)n(C(=O)OC3CC4CCC(C3)N4C)c2c1
: