Target
Metabotropic glutamate receptor 1
Ligand
BDBM50212323
Substrate
Ki
>10000±n/a nM
Comments
PDSP_342
Citation
 Carroll, FYStolle, ABeart, PMVoerste, ABrabet, IMauler, FJoly, CAntonicek, HBockaert, JMüller, TPin, JPPrézeau, L BAY36-7620: a potent non-competitive mGlu1 receptor antagonist with inverse agonist activity. Mol Pharmacol 59:965-73 (2001) Target
Name:
Metabotropic glutamate receptor 1
Synonyms:
GRM1_RAT Grm1 Metabotropic glutamate receptor Mglur1 metabotropic glutamate 1/5-D metabotropic glutamate receptor 1 isoform alpha precursor
Type:
Enzyme Catalytic Domain
Mol. Mass.:
133240.47
Organism:
RAT
Description:
metabotropic glutamate 1/2 0 RAT::P23385
Residue:
1199
  
Inhibitor
Name:
BDBM50212323
Synonyms:
(3aS,6aS)-5-methylene-6a-(naphthalen-2-ylmethyl)-hexahydrocyclopenta[c]furan-1-one Bay 36-7620 | CHEMBL254372
Type:
Small organic molecule
Emp. Form.:
C19H18O2
Mol. Mass.:
278.345
SMILES:
C=C1C[C@@H]2COC(=O)[C@]2(Cc2ccc3ccccc3c2)C1
: