Target
Arachidonate 12-lipoxygenase, 12R-type
Ligand
BDBM86073
Substrate
Meas. Tech.
Inhibition Assay
pH
8±0
Temperature
298.15±0 K
IC50
1.955e+5±n/a nM
Citation
 Maharvi, GMAli, SRiaz, NAfza, NMalik, AAshraf, MIqbal, LLateef, M Mild and efficient synthesis of new tetraketones as lipoxygenase inhibitors and antioxidants. J Enzyme Inhib Med Chem 23:62-9 (2008)  
Target
Name:
Arachidonate 12-lipoxygenase, 12R-type
Synonyms:
ALOX12B Lipoxygenase
Type:
Enzyme
Mol. Mass.:
80366.80
Organism:
Homo sapiens (Human)
Description:
O75342
Residue:
701
  
Inhibitor
Name:
BDBM86073
Synonyms:
Tetraketone, 7
Type:
Small organic molecule
Emp. Form.:
C24H30O5
Mol. Mass.:
398.492
SMILES:
COc1ccccc1C(C1C(=O)CC(C)(C)CC1=O)C1C(=O)CC(C)(C)CC1=O
: