Target
Arachidonate 12-lipoxygenase, 12R-type
Ligand
BDBM86083
Substrate
Meas. Tech.
Inhibition Assay
pH
8±0
Temperature
298.15±0 K
IC50
3.54e+4±n/a nM
Citation
 Maharvi, GMAli, SRiaz, NAfza, NMalik, AAshraf, MIqbal, LLateef, M Mild and efficient synthesis of new tetraketones as lipoxygenase inhibitors and antioxidants. J Enzyme Inhib Med Chem 23:62-9 (2008)  
Target
Name:
Arachidonate 12-lipoxygenase, 12R-type
Synonyms:
ALOX12B Lipoxygenase
Type:
Enzyme
Mol. Mass.:
80366.80
Organism:
Homo sapiens (Human)
Description:
O75342
Residue:
701
  
Inhibitor
Name:
BDBM86083
Synonyms:
Tetraketone, 20
Type:
Small organic molecule
Emp. Form.:
C31H33BrO4
Mol. Mass.:
549.495
SMILES:
CC1(C)CC(=O)C(C(C2C(=O)CC(C)(C)CC2=O)c2ccc(cc2)C(\Br)=C\c2ccccc2)C(=O)C1
: