Target
Sodium-dependent noradrenaline transporter
Ligand
BDBM86207
Substrate
Ki
2420±n/a nM
Comments
PDSP_556
Citation
 Miller, DKCrooks, PAZheng, GGrinevich, VPNorrholm, SDDwoskin, LP Lobeline analogs with enhanced affinity and selectivity for plasmalemma and vesicular monoamine transporters. J Pharmacol Exp Ther 310:1035-45 (2004)  
Target
Name:
Sodium-dependent noradrenaline transporter
Synonyms:
Monoamine transporter NET Noradrenaline Transporter (NET) Norepinephrine transporter protein (NET) SLC6A2 Sodium-dependent noradrenaline transporter (NET) | Solute carrier family 6 member 2
Type:
Multi-pass membrane protein
Mol. Mass.:
69337.72
Organism:
Homo sapiens (Human)
Description:
P23975
Residue:
617
  
Inhibitor
Name:
BDBM86207
Synonyms:
CAS_50-36-2 NSC_446220
Type:
Small organic molecule
Emp. Form.:
C17H21NO4
Mol. Mass.:
303.3529
SMILES:
COC(=O)C1C2CCC(CC1OC(=O)c1ccccc1)N2C
: