Target
Interleukin-1 receptor-associated kinase 4
Ligand
BDBM278712
Substrate
Meas. Tech.
IRAK4 Kinase Assay
pH
7.2±n/a
IC50
27.0±n/a nM
Comments
extracted
Citation
 Lim, JAltman, MDBrubaker, JDGibeau, CR Pyrrolopyridazine inhibitors of IRAK4 activity US Patent  US10040798 Publication Date 8/7/2018 
Target
Name:
Interleukin-1 receptor-associated kinase 4
Synonyms:
IRAK-4 IRAK4_HUMAN Interleukin-1 receptor-associated kinase 4 (IRAK4) | Renal carcinoma antigen NY-REN-64
Type:
Protein
Mol. Mass.:
51519.08
Organism:
Homo sapiens (Human)
Description:
Q9NWZ3
Residue:
460
  
Inhibitor
Name:
BDBM278712
Synonyms:
2-(5,8- diazaspiro[2.6]non-5- yl)-N-[1-methyl-3- (trifluoromethyl)-1H- pyrazol-4- yl]pyrrolo[1,2- b]pyridazine-7- carboxamide trifluoroacetate | US10040798, Example 9
Type:
Small organic molecule
Emp. Form.:
C22H23F6N7O3
Mol. Mass.:
547.4535
SMILES:
OC(=O)C(F)(F)F.Cn1cc(NC(=O)c2ccc3ccc(nn23)N2CCNCC3(CC3)C2)c(n1)C(F)(F)F
: