Target
Interleukin-1 receptor-associated kinase 4
Ligand
BDBM278793
Substrate
Meas. Tech.
IRAK4 Kinase Assay
pH
7.2±n/a
IC50
6371±n/a nM
Comments
extracted
Citation
 Lim, JAltman, MDBrubaker, JDGibeau, CR Pyrrolopyridazine inhibitors of IRAK4 activity US Patent  US10040798 Publication Date 8/7/2018 
Target
Name:
Interleukin-1 receptor-associated kinase 4
Synonyms:
IRAK-4 IRAK4_HUMAN Interleukin-1 receptor-associated kinase 4 (IRAK4) | Renal carcinoma antigen NY-REN-64
Type:
Protein
Mol. Mass.:
51519.08
Organism:
Homo sapiens (Human)
Description:
Q9NWZ3
Residue:
460
  
Inhibitor
Name:
BDBM278793
Synonyms:
N-(2-chlorothiophen-3- yl)-2-{[(1R,2S)-2- hydroxycyclohexyl] amino}pyrrolo[1,2- b]pyridazine-7- carboxamide | US10040798, Example 91
Type:
Small organic molecule
Emp. Form.:
C18H19ClN4O2S
Mol. Mass.:
390.887
SMILES:
O[C@H]1CCCC[C@H]1Nc1ccc2ccc(C(=O)Nc3ccsc3Cl)n2n1
: