Target
Acyl-protein thioesterase 2
Ligand
BDBM92727
Substrate
Meas. Tech.
Enzymatic Protein Activity Assay
IC50
1.98e+3± 9e+1 nM
Citation
 Zimmermann, TJBürger, MTashiro, EKondoh, YMartinez, NEGörmer, KRosin-Steiner, SShimizu, TOzaki, SMikoshiba, KWatanabe, NHall, DVetter, IROsada, HHedberg, CWaldmann, H Boron-based inhibitors of acyl protein thioesterases 1 and 2. Chembiochem 14:115-22 (2013)  
Target
Name:
Acyl-protein thioesterase 2
Synonyms:
APT2 LYPA2_HUMAN Lysophospholipase II
Type:
Protein
Mol. Mass.:
24740.23
Organism:
Homo sapiens (Human)
Description:
O95372
Residue:
231
  
Inhibitor
Name:
BDBM92727
Synonyms:
Phenylboronic acid, 20
Type:
Small molecule
Emp. Form.:
C4H4BBrO2S
Mol. Mass.:
206.853
SMILES:
OB(O)c1cscc1Br
: