Target
TGF-beta receptor type-1
Ligand
BDBM280350
Substrate
Meas. Tech.
In Vitro Kinase Assay Inhibition of ALK1/2/3/4/5/6 Kinases
IC50
50.8±n/a nM
Citation
 Rai, RChakravarty, SPujala, BShinde, BUNayak, AKChaklan, NAgarwal, AKRamachandran, SAPham, SM Compounds and methods of use US Patent  US10030004 Publication Date 7/24/2018 
Target
Name:
TGF-beta receptor type-1
Synonyms:
ALK-5 Activin A receptor type II-like protein kinase of 53kD SKR4 TGF-beta receptor type I TGFBR1 TGFR1_HUMAN Transforming growth factor-beta receptor type I
Type:
enzyme
Mol. Mass.:
55968.24
Organism:
Homo sapiens (Human)
Description:
P36897
Residue:
503
  
Inhibitor
Name:
BDBM280350
Synonyms:
4-[[2-(5-chloro-2-fluoro-phenyl)-5-(1-methoxy-1-methyl-ethyl)-4-pyridyl]amino]-N-(2-hydroxypropyl)pyridine-3-carboxamide US10501436, Compound 17a US11702401, Compound 17a
Type:
Small organic molecule
Emp. Form.:
C24H26ClFN4O3
Mol. Mass.:
472.94
SMILES:
COC(C)(C)c1cnc(cc1Nc1ccncc1C(=O)NCC(C)O)-c1cc(Cl)ccc1F
: