Target
Epoxide hydrolase 1
Ligand
BDBM100373
Substrate
Meas. Tech.
Inhibition Assay
IC50
7.6±0.0 nM
Citation
 Hammock, BDJones, PDMorisseau, CHuang, HTsai, HGless, Jr., R Conformationally restricted urea inhibitors of soluble epoxide hydrolase US Patent  US8501783 Publication Date 8/6/2013 
Target
Name:
Epoxide hydrolase 1
Synonyms:
EPHX EPOX Epoxide hydrolase (HsEH) HYEP_HUMAN | Microsomal epoxide hydrolase
Type:
Protein
Mol. Mass.:
52954.28
Organism:
Homo sapiens (Human)
Description:
P07099
Residue:
455
  
Inhibitor
Name:
BDBM100373
Synonyms:
US8501783, 1207
Type:
Small organic molecule
Emp. Form.:
C23H32N4O2
Mol. Mass.:
396.5258
SMILES:
O=C(NCC1CCN(CC1)C(=O)c1ccccn1)NC12CC3CC(CC(C3)C1)C2
: