Target
Transmembrane prolyl 4-hydroxylase
Ligand
BDBM3734
Substrate
Meas. Tech.
In Vitro Inhibition Assay
pH
7.5±0
Temperature
298.15±0 K
IC50
4.0e+3±n/a nM
Citation
 Thede, KFlamme, IOehme, FErgüden, JStoll, FSchuhmacher, JWild, HKolkhof, PBeck, HAkbaba, MJeske, M Substituted dihydropyrazolones and use thereof as HIF-prolyl-4-hydroxylase inhibitors US Patent  US8524699 Publication Date 9/3/2013 
Target
Name:
Transmembrane prolyl 4-hydroxylase
Synonyms:
Hypoxia-inducible factor prolyl 4-hydroxylase Hypoxia-inducible factor prolyl hydroxylase 4 P4HTM PH4 | Transmembrane prolyl 4-hydroxylase
Type:
Enzyme
Mol. Mass.:
56654.25
Organism:
Homo sapiens (Human)
Description:
Q9NXG6
Residue:
502
  
Inhibitor
Name:
BDBM3734
Synonyms:
US8524699, 26
Type:
Emp. Form.:
C16H18N6O2
Mol. Mass.:
326.3531
SMILES:
CN(C)CCOc1cc(ncn1)-n1[nH]cc(-c2cccnc2)c1=O
: