Target
Complement factor D
Ligand
BDBM111072
Substrate
Meas. Tech.
Human Factor D Assay
pH
7.5±n/a
Temperature
298.15±n/a K
IC50
<1000±n/a nM
Comments
extracted
Citation
 Wiles, JAWang, QGadhachanda, VRPais, GHashimoto, AChen, DWang, XAgarwal, ADeshpande, MPhadke, AS Amide compounds for treatment of complement mediated disorders US Patent  US9695205 Publication Date 7/4/2017 
Target
Name:
Complement factor D
Synonyms:
Adipsin CFAD_HUMAN DF Properdin factor D
Type:
Protein
Mol. Mass.:
27039.19
Organism:
Homo sapiens (Human)
Description:
P00746
Residue:
253
  
Inhibitor
Name:
BDBM111072
Synonyms:
US9695205, 50
Type:
Small organic molecule
Emp. Form.:
C35H40ClF2N5O6
Mol. Mass.:
700.172
SMILES:
CC(=O)c1cn(CC(=O)N2C[C@H](F)C[C@H]2C(=O)NCc2cccc(Cl)c2F)c2cc(ccc12)C(=O)NCC1CCN(C1)C(=O)OC(C)(C)C
: