Target
Dual specificity mitogen-activated protein kinase kinase 1
Ligand
BDBM104946
Substrate
Meas. Tech.
Inhibition Assay
IC50
28±n/a nM
Citation
 Isshiki, YKohchi, YMizuguchi, EIikura, HMatsubara, YTsujii, SShimma, NMiwa, MAida, SKohchi, MMurata, TAso, K 5-substituted-2-phenylamino benzamides as MEK inhibitors US Patent  US8575391 Publication Date 11/5/2013 
Target
Name:
Dual specificity mitogen-activated protein kinase kinase 1
Synonyms:
Dual specificity mitogen-activated protein kinase (MEK) Dual specificity mitogen-activated protein kinase kinase 1 (MEK1) Dual specificity mitogen-activated protein kinase kinase MEK1/2 MAP kinase kinase 1 MAPK/ERK kinase 1 MEK-1 MP2K1_HUMAN PRKMK1 | VHL-MAP2K1/MAP2K2
Type:
Other Protein Type
Mol. Mass.:
43439.03
Organism:
Homo sapiens (Human)
Description:
Full-length human MEK-1 was generated by PCR and purified as a fusion protein from Escherichia coli lysates.
Residue:
393
  
Inhibitor
Name:
BDBM104946
Synonyms:
US8575391, C-13
Type:
Small organic molecule
Emp. Form.:
C19H20F3IN4O5
Mol. Mass.:
568.2856
SMILES:
CNC(=O)CONCc1cc(C(=O)NOCCO)c(Nc2ccc(I)cc2F)c(F)c1F
: