Target
Cyclin-dependent kinase 9
Ligand
BDBM106960
Substrate
Meas. Tech.
Kinase Assay
pH
7.5±0
Temperature
303.15±0 K
IC50
2.5e+2±n/a nM
Citation
 Sheldrake, PWAtrash, BGreen, SMcDonald, EFrame, S Trisubstituted purine derivatives US Patent  US8592581 Publication Date 11/26/2013 
Target
Name:
Cyclin-dependent kinase 9
Synonyms:
C-2K CDK9 Cell division cycle 2-like protein kinase 4 Cyclin-Dependent Kinase 9 (CDK9) Serine/threonine-protein kinase PITALRE Tat-associated kinase complex catalytic subunit
Type:
Enzyme Subunit
Mol. Mass.:
42789.13
Organism:
Homo sapiens (Human)
Description:
Residue:
372
  
Inhibitor
Name:
BDBM106960
Synonyms:
US8592581, 11
Type:
Small organic molecule
Emp. Form.:
C20H26F3N7O
Mol. Mass.:
437.4619
SMILES:
CC[C@H](Nc1nc(NCc2ccc(nc2)C(F)(F)F)c2ncn(C(C)C)c2n1)[C@@H](C)O
: