Target
Histone deacetylase 6
Ligand
BDBM109955
Substrate
Meas. Tech.
Enzyme Assays
pH
7.4±0
IC50
45±0.0 nM
Citation
 Van Duzer, JHMazitschek, ROgier, WBradner, JEHuang, GXie, DYu, N Reverse amide compounds as protein deacetylase inhibitors and methods of use thereof US Patent  US8609678 Publication Date 12/17/2013 
Target
Name:
Histone deacetylase 6
Synonyms:
Cereblon/Histone deacetylase 6 HDAC6 Histone deacetylase 6 (HDAC6) KIAA0901 | ORF Names:JM21
Type:
Chromatin regulator; hydrolase; repressor
Mol. Mass.:
131381.51
Organism:
Homo sapiens (Human)
Description:
Q9UBN7
Residue:
1215
  
Inhibitor
Name:
BDBM109955
Synonyms:
US8609678, 4-((2,6-diisopropylphenyl)(methyl)amino)-N-(7-(hydroxyamino)-7-oxoheptyl)benzamide [7]
Type:
Small organic molecule
Emp. Form.:
C27H39N3O3
Mol. Mass.:
453.6169
SMILES:
CC(C)c1cccc(C(C)C)c1N(C)c1ccc(cc1)C(=O)NCCCCCCC(=O)NO
: