Target
Isoform C of Beta-secretase 1 (BACE-I-457)
Ligand
BDBM113349
Substrate
Meas. Tech.
BACE Assay
IC50
877.1±n/a nM
Citation
 Cacatian, SClaremon, DADillard, LWFuchs, KHeine, NJia, LLeftheris, KMcKeever, BMorales-Ramos, ASingh, SBVenkatraman, SWu, GWu, ZXu, ZYuan, JZheng, Y Inhibitors of beta-secretase US Patent  US8633212 Publication Date 1/21/2014 
Target
Name:
Isoform C of Beta-secretase 1 (BACE-I-457)
Synonyms:
BACE BACE1_HUMAN Beta-secretase 1 (BACE-I-457) | KIAA1149
Type:
Enzyme
Mol. Mass.:
51006.30
Organism:
Homo sapiens (Human)
Description:
P56817-3
Residue:
457
  
Inhibitor
Name:
BDBM113349
Synonyms:
US10336717, Compound 517 US9212153, 517
Type:
Small organic molecule
Emp. Form.:
C24H29N3O3
Mol. Mass.:
407.5054
SMILES:
COc1cccc(c1)-c1ccc2C[C@]3(CC[C@@](C)(O)CC3)C3(ON(C)C(N)=N3)c2c1
: