Target
Isoform C of Beta-secretase 1 (BACE-I-457)
Ligand
BDBM113285
Substrate
Meas. Tech.
Enzyme Assay
pH
4.5±n/a
Temperature
298.15±n/a K
IC50
5053.9±n/a nM
Comments
extracted
Citation
 Cacatian, SClaremon, DADillard, LWFuchs, KHeine, NJia, LLeftheris, KMcKeever, BMorales-Ramos, ASingh, SBVenkatraman, SWu, GWu, ZXu, ZYuan, JZheng, Y Inhibitors of beta-secretase US Patent  US8633212 Publication Date 1/21/2014 
Target
Name:
Isoform C of Beta-secretase 1 (BACE-I-457)
Synonyms:
BACE BACE1_HUMAN Beta-secretase 1 (BACE-I-457) | KIAA1149
Type:
Enzyme
Mol. Mass.:
51006.30
Organism:
Homo sapiens (Human)
Description:
P56817-3
Residue:
457
  
Inhibitor
Name:
BDBM113285
Synonyms:
US10336717, Compound 63 | US8633212, 63
Type:
Small organic molecule
Emp. Form.:
C29H28N4O
Mol. Mass.:
448.5588
SMILES:
CN1OC2(N=C1N)c1cc(ccc1CCC21CCc2ccccc2CC1)-c1cccc(c1)C#N
: