Target
UDP-N-acetylmuramate--L-alanine ligase
Ligand
BDBM123125
Substrate
Meas. Tech.
E.coli MurC assay
Temperature
298.15±0 K
IC50
3±n/a nM
Citation
 Hameed P, SManjrekar, PChinnapattu, MHumnabadkar, VShanbhag, GKedari, CMudugal, NVAmbady, Ade Jonge, BLSadler, CPaul, BSriram, SKaur, PGuptha, SRaichurkar, AFleming, PEyermann, CJMcKinney, DCSambandamurthy, VKPanda, MRavishankar, S Pyrazolopyrimidines Establish MurC as a Vulnerable Target in Pseudomonas aeruginosa and Escherichia coli. ACS Chem Biol 9:2274-82 (2014)  
Target
Name:
UDP-N-acetylmuramate--L-alanine ligase
Synonyms:
MURC_ECOLI UDP-N-acetylmuramate--L-alanine ligase | murC
Type:
Protein
Mol. Mass.:
53617.78
Organism:
Escherichia coli
Description:
P17952
Residue:
491
  
Inhibitor
Name:
BDBM123125
Synonyms:
(R)-2-(4-(5-tert-butyl-1-methyl-1H-pyrazol-3-ylamino)-1H-pyrazolo[3,4-d]pyrimidin-6-ylamino)-2-phenylethyl ((S)-3-methyl-2-oxoimidazolidin-4-yl)methylcarbamate (24)
Type:
Small organic molecule
Emp. Form.:
C27H35N11O3
Mol. Mass.:
561.6387
SMILES:
CN1[C@H](CNC(=O)OC[C@H](Nc2nc(Nc3cc(n(C)n3)C(C)(C)C)c3c[nH]nc3n2)c2ccccc2)CNC1=O
: