Target
Tyrosine-protein phosphatase non-receptor type 1
Ligand
BDBM124264
Substrate
Meas. Tech.
PTP inhibition assay
pH
7.2±n/a
IC50
9.3e+2± 9e+3 nM
Comments
extracted
Citation
 Han, HLu, LWang, QZhu, MYuan, CXing, SFu, X Synthesis and evaluation of oxovanadium(IV) complexes of Schiff-base condensates from 5-substituted-2-hydroxybenzaldehyde and 2-substituted-benzenamine as selective inhibitors of protein tyrosine phosphatase 1B. Dalton Trans 41:11116-24 (2012)  
Target
Name:
Tyrosine-protein phosphatase non-receptor type 1
Synonyms:
PTN1_HUMAN PTPN1 Protein tyrosine phosphatase-1B (PTP1B) Protein-tyrosine phosphatase 1B (PTP1B) Tyrosine-protein phosphatase non-receptor type 1 (PTP1B)
Type:
Protein phosphatase
Mol. Mass.:
49963.76
Organism:
Homo sapiens (Human)
Description:
Human recombinant GST-fusion PTP1B (1-435).
Residue:
435
  
Inhibitor
Name:
BDBM124264
Synonyms:
Bis(4-nitro-2-((phenylimino)methyl)phenolate)-oxovanadium(IV) (5)
Type:
Small organic molecule
Emp. Form.:
C26H18N4O7V
Mol. Mass.:
549.3852
SMILES:
[O-][N+](=O)c1ccc2O[V]3(=O)(Oc4ccc(cc4C=[N]3c3ccccc3)[N+]([O-])=O)[N](=Cc2c1)c1ccccc1
: