Target
Fatty-acid amide hydrolase 1
Ligand
BDBM143309
Substrate
Meas. Tech.
FAAH Assay
pH
7.4±n/a
Temperature
298.15±n/a K
IC50
10.00±n/a nM
Comments
extracted
Citation
 Kharul, RBhuniya, DMookhtiar, KASingh, UHazare, APatil, SDatrange, LThakkar, M Amide compounds, compositions and applications thereof US Patent  US9682953 Publication Date 6/20/2017 
Target
Name:
Fatty-acid amide hydrolase 1
Synonyms:
Anandamide amidohydrolase FAAH FAAH1_HUMAN Fatty-acid amide hydrolase (FAAH) Oleamide hydrolase 1
Type:
Protein
Mol. Mass.:
63071.19
Organism:
Homo sapiens (Human)
Description:
O00519
Residue:
579
  
Inhibitor
Name:
BDBM143309
Synonyms:
US9682953, 6.1
Type:
Small organic molecule
Emp. Form.:
C27H26F3N3O3
Mol. Mass.:
497.5088
SMILES:
CCOc1ccc(cn1)C(=O)NC1CCC(CC1)=Cc1cccc(Oc2ccc(cn2)C(F)(F)F)c1
: