Target
Fatty-acid amide hydrolase 1 [30-579]
Ligand
BDBM143267
Substrate
Meas. Tech.
FAAH Assay
pH
7.4±n/a
Temperature
298.15±n/a K
IC50
9.00±n/a nM
Comments
extracted
Citation
 Kharul, RBhuniya, DMookhtiar, KASingh, UHazare, APatil, SDatrange, LThakkar, M Amide compounds, compositions and applications thereof US Patent  US9682953 Publication Date 6/20/2017 
Target
Name:
Fatty-acid amide hydrolase 1 [30-579]
Synonyms:
Anandamide amidohydrolase 1 Faah Fatty Acid Amide Hydrolase Fatty-acid amide hydrolase (FAAH) Fatty-acid amide hydrolase 1 (FAAH) Oleamide hydrolase 1
Type:
Single-pass membrane protein; homodimer
Mol. Mass.:
60474.00
Organism:
Rattus norvegicus (rat)
Description:
P97612 (aa 30-579)
Residue:
550
  
Inhibitor
Name:
BDBM143267
Synonyms:
US9682953, 2.B-15
Type:
Small organic molecule
Emp. Form.:
C27H23F3N6O2
Mol. Mass.:
520.5057
SMILES:
FC(F)(F)c1ccc(Oc2cccc(C=C3CCC(CC3)NC(=O)c3ccc(nc3)-n3nccn3)c2)nc1
: