Target
Coagulation factor X
Ligand
BDBM7840
Substrate
Meas. Tech.
Enzyme Inhibition Assay
Temperature
298.15±n/a K
IC50
1.4±n/a nM
Comments
extracted
Citation
 Straub, ALampe, TPohlmann, JRöhrig, SPerzborn, ESchlemmer, KPernerstofer, J Substituted oxazolidinones and their use in the field of blood coagulation US Patent  US8822458 Publication Date 9/2/2014 
Target
Name:
Coagulation factor X
Synonyms:
Activated coagulation factor X (FXa) Coagulation factor X precursor F10 Factor X heavy chain Factor Xa Stuart-Prower factor
Type:
Enzyme
Mol. Mass.:
54726.60
Organism:
Homo sapiens (Human)
Description:
Residue:
488
  
Inhibitor
Name:
BDBM7840
Synonyms:
RIVAROXABAN US8822458, 97
Type:
Emp. Form.:
C19H18ClN3O5S
Mol. Mass.:
435.881
SMILES:
Clc1ccc(s1)C(=O)NC[C@H]1CN(C(=O)O1)c1ccc(cc1)N1CCOCC1=O
: