Target
Isoform 3 of cAMP-specific 3',5'-cyclic phosphodiesterase 4D (hPDE4D3)
Ligand
BDBM285536
Substrate
Meas. Tech.
The PDE4A3, PDE4B1, PDE4C1 and PDE4D3 assays
IC50
1490±n/a nM
Citation
 Chappie, TAPatel, NCHayward, MMHelal, CJSciabola, SLaChapelle, EAYoung, JMVerhoest, PR Imidazopyridazine compounds US Patent  US10077269 Publication Date 9/18/2018 
Target
Name:
Isoform 3 of cAMP-specific 3',5'-cyclic phosphodiesterase 4D (hPDE4D3)
Synonyms:
DPDE3 NP_000914.2 PDE4D PDE4D_HUMAN Q08499-2 cAMP-specific 3',5'-cyclic phosphodiesterase 4D (hPDE4D3)
Type:
Mol. Mass.:
76431.39
Organism:
Homo sapiens (Human)
Description:
Q08499-2
Residue:
673
  
Inhibitor
Name:
BDBM285536
Synonyms:
3-(4-Chloro-2,5-difluorophenyl)-N-cyclopropylimidazo[1,2-b]pyridazine-2-carboxamide (9) US10669279, Example 9 | US9598421, Example 9
Type:
Small organic molecule
Emp. Form.:
C16H11ClF2N4O
Mol. Mass.:
348.735
SMILES:
Fc1cc(-c2c(nc3cccnn23)C(=O)NC2CC2)c(F)cc1Cl
: