Target
Serine/threonine-protein kinase mTOR
Ligand
BDBM136464
Substrate
Meas. Tech.
Kinase Assay
pH
7.5±n/a
Temperature
295.15±n/a K
IC50
1.2±n/a nM
Comments
extracted
Citation
 Andrews, SWCondroski, KRDe Meese, LAFell, JBFischer, JPJosey, JAKoch, KLe Huerou, YMiknis, GFRodriguez, METopalov, GTWallace, EMXu, R Substituted pyrazolo[1,5-a]pyrimidine compounds as mTOR inhibitors US Patent  US8865726 Publication Date 10/21/2014 
Target
Name:
Serine/threonine-protein kinase mTOR
Synonyms:
FK506-binding protein 12-rapamycin complex-associated protein 1 FRAP FRAP1 MTOR Mammalian Target of Rapamycin (mTOR) RAFT1 Rapamycin and FKBP12 target 1 Serine/threonine-protein kinase (mTOR) | mTORC2
Type:
Rapamycin target protein
Mol. Mass.:
288917.12
Organism:
Homo sapiens (Human)
Description:
P42345
Residue:
2549
  
Inhibitor
Name:
BDBM136464
Synonyms:
US8865726, 95
Type:
Small organic molecule
Emp. Form.:
C23H15ClFN7O2
Mol. Mass.:
475.862
SMILES:
Fc1ccc(cc1Cl)[C@H]1COC(=O)N1c1ccn2ncc(-c3ccc(cc3)-c3nc[nH]n3)c2n1
: