Target
Sphingosine 1-phosphate receptor 1
Ligand
BDBM139209
Substrate
Meas. Tech.
In Vitro Assay
pH
7.4±n/a
Temperature
277.15±n/a K
Ki
2±n/a nM
Comments
extracted
Citation
 Montagne, CQuattropani, ASauer, WBombrun, A Oxadiazole diaryl compounds US Patent  US8889668 Publication Date 11/18/2014 
Target
Name:
Sphingosine 1-phosphate receptor 1
Synonyms:
CHEDG1 Endothelial differentiation G-protein coupled receptor 1 S1P1 S1PR1_HUMAN Sphingosine 1-phosphate receptor Edg-1
Type:
Enzyme
Mol. Mass.:
42836.02
Organism:
Homo sapiens (Human)
Description:
P21453
Residue:
382
  
Inhibitor
Name:
BDBM139209
Synonyms:
US8889668, I57
Type:
Small organic molecule
Emp. Form.:
C21H15F3N2O2S
Mol. Mass.:
416.416
SMILES:
COc1ccccc1-c1noc(n1)-c1ccc(-c2cscc2C)c(c1)C(F)(F)F
: