Target
Histone deacetylase 6
Ligand
BDBM139260
Substrate
Meas. Tech.
Enzyme Assay
pH
7.4±n/a
Temperature
298.15±n/a K
IC50
2±n/a nM
Comments
extracted
Citation
 van Duzer, JHMazitschek, RDing, YYu, NCao, YLiu, Y Pyrimidine hydroxy amide compounds as protein deacetylase inhibitors and methods of use thereof US Patent  US8614223 Publication Date 12/24/2013 
Target
Name:
Histone deacetylase 6
Synonyms:
Cereblon/Histone deacetylase 6 HDAC6 Histone deacetylase 6 (HDAC6) KIAA0901 | ORF Names:JM21
Type:
Chromatin regulator; hydrolase; repressor
Mol. Mass.:
131381.51
Organism:
Homo sapiens (Human)
Description:
Q9UBN7
Residue:
1215
  
Inhibitor
Name:
BDBM139260
Synonyms:
US8614223, 36
Type:
Small organic molecule
Emp. Form.:
C12H11ClN4O2
Mol. Mass.:
278.694
SMILES:
ONC(=O)c1cnc(NCc2ccc(Cl)cc2)nc1
: