Target
DNA gyrase subunit A
Ligand
BDBM139401
Substrate
Meas. Tech.
Fluorescence Polarisation Assay
pH
7.5±n/a
IC50
420±n/a nM
Comments
extracted
Citation
 Basarab, GSGowravaram, MRHauck, SIZhou, F Compounds and methods for treating bacterial infections US Patent  US8889671 Publication Date 11/18/2014 
Target
Name:
DNA gyrase subunit A
Synonyms:
DNA gyrase GYRA_ECOLI hisW parD
Type:
Enzyme Subunit
Mol. Mass.:
96935.15
Organism:
Escherichia coli (strain K12)
Description:
Residue:
875
  
Inhibitor
Name:
BDBM139401
Synonyms:
US8889671, 31
Type:
Small organic molecule
Emp. Form.:
C23H24FN5O8
Mol. Mass.:
517.4638
SMILES:
C[C@@H]1CN2[C@H]([C@H](C)O1)C1(Cc3cc4c(noc4c(F)c23)N2[C@@H](CCO)COC2=O)C(=O)NC(=O)NC1=O
: