Target
DNA gyrase subunit A
Ligand
BDBM139388
Substrate
Meas. Tech.
Fluorescence Polarisation Assay
pH
7.5±n/a
IC50
330±n/a nM
Comments
extracted
Citation
 Basarab, GSGowravaram, MRHauck, SIZhou, F Compounds and methods for treating bacterial infections US Patent  US8889671 Publication Date 11/18/2014 
Target
Name:
DNA gyrase subunit A
Synonyms:
DNA gyrase GYRA_ECOLI hisW parD
Type:
Enzyme Subunit
Mol. Mass.:
96935.15
Organism:
Escherichia coli (strain K12)
Description:
Residue:
875
  
Inhibitor
Name:
BDBM139388
Synonyms:
US8889671, 17 | US8889671, 67
Type:
Small organic molecule
Emp. Form.:
C23H24FN5O8
Mol. Mass.:
517.4638
SMILES:
COC[C@H]1COC(=O)N1c1noc2c(F)c3N4C[C@@H](C)O[C@@H](C)[C@@H]4C4(Cc3cc12)C(=O)NC(=O)NC4=O
: