Target
DNA gyrase subunit A
Ligand
BDBM139437
Substrate
Meas. Tech.
Fluorescence Polarisation Assay
pH
7.5±n/a
IC50
470±n/a nM
Comments
extracted
Citation
 Basarab, GSGowravaram, MRHauck, SIZhou, F Compounds and methods for treating bacterial infections US Patent  US8889671 Publication Date 11/18/2014 
Target
Name:
DNA gyrase subunit A
Synonyms:
DNA gyrase GYRA_ECOLI hisW parD
Type:
Enzyme Subunit
Mol. Mass.:
96935.15
Organism:
Escherichia coli (strain K12)
Description:
Residue:
875
  
Inhibitor
Name:
BDBM139437
Synonyms:
US8889671, 74
Type:
Small organic molecule
Emp. Form.:
C22H21FN6O8
Mol. Mass.:
516.4359
SMILES:
C[C@@H]1CN2[C@H]([C@H](C)O1)C1(Cc3cc4c(noc4c(F)c23)N2[C@H](COC2=O)C=NO)C(=O)NC(=O)NC1=O
: