Target
cAMP and cAMP-inhibited cGMP 3',5'-cyclic phosphodiesterase 10A
Ligand
BDBM142594
Substrate
Meas. Tech.
Scintillation Proximity Assay
pH
7.5±n/a
IC50
0.194±n/a nM
Comments
extracted
Citation
 Chappie, TAHelal, CJKormos, BLTuttle, JBVerhoest, PR Triazine derivatives US Patent  US8933224 Publication Date 1/13/2015 
Target
Name:
cAMP and cAMP-inhibited cGMP 3',5'-cyclic phosphodiesterase 10A
Synonyms:
PDE10_RAT Phosphodiesterase 10 Phosphodiesterase Type 10 (PDE10A) | Rat recombinant PDE10a (rPDE10a)
Type:
Enzyme
Mol. Mass.:
90160.88
Organism:
Rattus norvegicus (rat)
Description:
PDE10A was generated from the full-length recombinant rat clone transfected into Sf9 cells.
Residue:
794
  
Inhibitor
Name:
BDBM142594
Synonyms:
US8933224, 12
Type:
Small organic molecule
Emp. Form.:
C20H25N7O
Mol. Mass.:
379.4588
SMILES:
Cc1nc([C@@H]2CCOC2)c2c(ncnn12)N1CCc2c(C1)c(nn2C)C1CC1
: