Target
cAMP and cAMP-inhibited cGMP 3',5'-cyclic phosphodiesterase 10A
Ligand
BDBM142446
Substrate
Meas. Tech.
Scintillation Proximity Assay
pH
7.5±n/a
IC50
0.193±n/a nM
Comments
extracted
Citation
 Chappie, TAHelal, CJKormos, BLTuttle, JBVerhoest, PR Triazine derivatives US Patent  US8933224 Publication Date 1/13/2015 
Target
Name:
cAMP and cAMP-inhibited cGMP 3',5'-cyclic phosphodiesterase 10A
Synonyms:
PDE10_RAT Phosphodiesterase 10 Phosphodiesterase Type 10 (PDE10A) | Rat recombinant PDE10a (rPDE10a)
Type:
Enzyme
Mol. Mass.:
90160.88
Organism:
Rattus norvegicus (rat)
Description:
PDE10A was generated from the full-length recombinant rat clone transfected into Sf9 cells.
Residue:
794
  
Inhibitor
Name:
BDBM142446
Synonyms:
US8933224, 173 | US8933224, 39
Type:
Small organic molecule
Emp. Form.:
C21H25N7O2
Mol. Mass.:
407.4689
SMILES:
COc1nc(nc2CCN(Cc12)c1ncnn2c(C)nc([C@@H]3CCOC3)c12)C1CC1
: