Target
Menin
Ligand
BDBM152230
Substrate
Meas. Tech.
NMR Spectroscopy Assay
IC50
1200±n/a nM
Citation
 Grembecka, JCierpicki, THess, J Compositions and methods for treatment of leukemia US Patent  US8993552 Publication Date 3/31/2015 
Target
Name:
Menin
Synonyms:
MEN1 Menin/Histone-lysine N-methyltransferase MLL | SCG2
Type:
Protein
Mol. Mass.:
68022.55
Organism:
Homo sapiens (Human)
Description:
O00255
Residue:
615
  
Inhibitor
Name:
BDBM152230
Synonyms:
US8993552, 65
Type:
Small organic molecule
Emp. Form.:
C17H23N5S2
Mol. Mass.:
361.528
SMILES:
CCc1cc2c(ncnc2s1)N1CCN(CC1)C1=NCC(C)(C)S1
: