Target
Proteinase-activated receptor 4
Ligand
BDBM286488
Substrate
Meas. Tech.
FLIPR Assay
Temperature
298.15±n/a K
IC50
1.09±n/a nM
Comments
extracted
Citation
 Martel, ATremblay, FMarinier, APriestley, ESPosy, SLLawrence, RMMiller, MM Imidazothiadiazole and imidazopyridazine derivatives as protease activated receptor 4 (PAR4) inhibitors for treating platelet aggregation US Patent  US9518064 Publication Date 12/13/2016 
Target
Name:
Proteinase-activated receptor 4
Synonyms:
Coagulation factor II receptor-like 3 PAR-4 PAR4_HUMAN Proteinase-activated receptor 4 (PAR4) | Thrombin receptor-like 3
Type:
Protein
Mol. Mass.:
41145.16
Organism:
Homo sapiens (Human)
Description:
Q96RI0
Residue:
385
  
Inhibitor
Name:
BDBM286488
Synonyms:
6-(6-Chloro-4-((3-(2-methoxypyrimidin-5-yl)benzyl)oxy)benzofuran-2-yl)-2-methoxyimidazo[2,1-b][1,3,4]thiadiazole | US9518064, Example 107
Type:
Small organic molecule
Emp. Form.:
C25H18ClN5O4S
Mol. Mass.:
519.96
SMILES:
COc1nn2cc(nc2s1)-c1cc2c(OCc3cccc(c3)-c3cnc(OC)nc3)cc(Cl)cc2o1
: