Target
Acetylcholinesterase
Ligand
BDBM152510
Substrate
Meas. Tech.
Acetylcholinesterase Inhibition Assay
pH
8±n/a
Ki
3.24±0.0 nM
IC50
4.88±0.0 nM
Comments
extracted
Citation
 Öztaskin, NÇetinkaya, YTaslimi, PGöksu, SGülçin, Ä° Antioxidant and acetylcholinesterase inhibition properties of novel bromophenol derivatives. Bioorg Chem 60:49-57 (2015)  
Target
Name:
Acetylcholinesterase
Synonyms:
ACES_HUMAN Acetylcholinesterase (AChE) | Acetylcholinesterase (human AChE)
Type:
Enzyme
Mol. Mass.:
67792.70
Organism:
Homo sapiens (Human)
Description:
P22303
Residue:
614
  
Inhibitor
Name:
BDBM152510
Synonyms:
(4-Bromo-2,5-dihydroxyphenyl)(phenyl)methanone (23)
Type:
Small organic molecule
Emp. Form.:
C13H9BrO3
Mol. Mass.:
293.113
SMILES:
Oc1cc(C(=O)c2ccccc2)c(O)cc1Br
: